{"text_format":"1","workbook":"xlsx","n_sheets":9,"sheets":["Cotizador","Instrucciones","COTIZACION","FACTORES","TARIFARIO","IMPRESION","IMPRESION_2","HISTORICO DE TARIFAS","CAMBIOS"],"not_rendered":{"charts":0,"images":5,"macros":1,"external_links":2,"defined_names":71,"comments":0,"pivot_tables":0},"unopened":[],"bounds":{"document_bytes":16777216,"sheet_cells":100000,"rows_first":2000,"rows_last":500,"rows_between":2000,"halvings":0,"cell_chars":16384,"cell_head_chars":4096},"cells_cut":0,"cells_raw":0,"read":"whole","date_system":"1900"}

{"sheet":"Cotizador","index":0,"n_rows":0,"n_cols":0,"rows_kept":0,"cut":false,"hidden":true,"merged":[]}

{"sheet":"Instrucciones","index":1,"n_rows":32,"n_cols":9,"rows_kept":32,"cut":false,"hidden":true,"merged":[[29,1,29,8],[28,1,28,8],[27,1,27,8],[23,1,23,8],[24,1,24,8],[26,1,26,8],[25,1,25,8],[33,1,33,8],[31,1,31,8],[37,1,37,8],[30,1,30,8],[32,1,32,8],[9,1,9,8],[17,1,17,8],[18,1,18,8],[20,1,20,8],[22,1,22,8],[11,1,11,8],[14,1,14,8],[21,1,21,8],[12,1,12,8],[16,1,16,8],[19,1,19,8]]}
[]
[]
[]
[]
[]
[]
[null,null,null,null,null,null,null,null,{"$f":"TODAY()","v":"2022-02-03"}]
[]
[]
[null,"INSTRUCCIONES"]
[]
[null,"Seguros Banorte elaboró para ti esta herramienta de sencilla utilización de la que . . . "]
[null," ¡Estamos seguros, te será de gran utilidad!"]
[]
[null,"A. Ingresa o selecciona de la lista desplegable tu clave de agente en la pestaña de COTIZACIÓN"]
{"$rows_left_out":18}
{"sheet":"COTIZACION","index":2,"n_rows":42,"n_cols":10,"rows_kept":42,"cut":false,"hidden":false,"merged":[[90,14,90,15],[88,14,88,15],[102,12,102,19],[103,12,104,19],[94,13,94,15],[92,12,92,13],[89,14,89,15],[1,1,1,2],[2,1,2,2],[11,12,11,19],[4,1,5,3],[77,12,77,15],[17,11,18,19],[39,2,39,4],[36,8,38,9],[41,1,41,5],[38,2,38,4]]}
[]
[]
[]
[]
[null,"DATOS DE LA PÓLIZA"]
[]
[null,"Tipo de póliza",null,"Nueva",{"$f":"IF(AND(D7=\"Nueva\",E28>64),\"COTIZACION INVALIDA\",IF(AND(D7=\"Nueva\",E29>64),\"COTIZACION INVALIDA\",\"OK\"))","v":"OK"}]
[null,"Nivel Hospitalario",null,"T+"]
[null,"Tipo de Cotización",null,"FAMILIAR"]
[null,"Suma Asegurada",null,100000000]
[null,"Tipo de Deducible",null,"POR PADECIMIENTO"]
[null,"Deducible",null,12000]
[null,"Coaseguro",null,"10% CON TOPE DE $35,000"]
[null,"Estado",null,"CIUDAD DE MÉXICO"]
[null,"Zona",null,{"$f":"VLOOKUP(D14,FACTORES!$N$3:$P$34,2,0)","v":8}]
{"$rows_left_out":28}
{"sheet":"FACTORES","index":3,"n_rows":103,"n_cols":59,"rows_kept":103,"cut":false,"hidden":true,"merged":[[32,52,32,53],[0,10,0,11]]}
[null,"TARIFA 2020",null,"ok",null,null,"DEDUCIBLE ","POR PADECIMIENTO","ANUAL",null,"COASEGURO",null,null,"Estados",null,null,null,"Zonas",null,null,"SUMA ASEGURADA",null,null,"RECARGO POR PAGO FRACCIONADO",null,null,null,null,"APLICACIÓN DE FACTORES",null,null,"COBERTURAS ADICIONALES"]
[null,"Edad","Hombre","Mujer",null,null,"IMPORTE","FACTOR","FACTOR",null,"%","FACTOR",null,"ESTADO DE LA REPUBLICA","REGIÓN PREFERENTE","Zona",null,"ZONA","FACTOR",null,"SUMA ASEGURADA","FACTOR",null,"PERIODO","FIJO","CAPTURA","% CALCULO",null,"CONCEPTO","FACTOR",null,"CONCEPTO","FACTOR",null,"Participante","Basica","Maternidad","Adicionales","EDxA","Cob Ext","Total",null,null,null,null,null,null,"EMERGENCIA EN EL EXTRANJERO",null,null,null,"DED CERO POR ACC","COSTO",null,null,"RPF","FIJO","CAPTURA","% CALCULO"]
[null,0,9815.6049854339035,9779.1276858485235,null,null,12000,0.83099999999999996,{"$f":"ROUND(H3*$I$18,3)","v":0.751},null,"10% CON TOPE DE $35,000",0.92200000000000004,null,"AGUASCALIENTES",5,3,null,1,0.65,null,200000,0.67700000000000005,null,"SEMESTRAL",4.7300000000000002E-2,{"$f":"+COTIZACION!H37","v":4.7300000000000002E-2},{"$f":"IF(Z3=0,1+Y3,1+Z3)","v":1.0472999999999999},null,"Nivel Hospitalario",{"$f":"VLOOKUP(COTIZACION!D8,FACTORES!$R$17:$S$18,2,0)","v":0.84},null,"Emergencia en el extranjero",{"$f":"$AD$26","v":173.66276482014834},null,1,{"$f":"(IF(COTIZACION!F28=\"EDAD NO PERMITIDA\",\"EDAD NO PERMITIDA\",IF(IMPRESION!H71=\"\",\"\",IF(IMPRESION!I71=\"HOMBRE\",VLOOKUP(IMPRESION!H71,FACTORES!$B$3:$D$103,2,0)*FACTORES!$AD$9,IF(IMPRESION!I71=\"MUJER\",VLOOKUP(IMPRESION!H71,FACTORES!$B$3:$D$103,3,0)*FACTORES!$AD$9,\"\")))))","v":36510.965268776752},{"$f":"IF(COTIZACION!D28=\"\",\"\",IF(AND(COTIZACION!D28=\"MUJER\",50>COTIZACION!E28,COTIZACION!E28>17,COTIZACION!$D$12>45000),FACTORES!$L$21,IF(AND(COTIZACION!D28=\"mujer\",50>COTIZACION!E28,COTIZACION!E28>17),VLOOKUP(COTIZACION!$D$17,FACTORES!$K$21:$L$23,2,0),0)))","v":0},{"$f":"IF(AND(COTIZACION!E28>17,COTIZACION!E28<60),IF(AJ3=\"\",\"\",$AG$8),IF(AJ3=\"\",\"\",$AG$8-$AG$7))","v":412.44982732014836},{"$f":"IF(AJ3=\"\",\"\",IF(COTIZACION!E28<20,FACTORES!$AG$26,FACTORES!$AG$27))","v":1936.2048985447832},{"$f":"IFERROR(IF(COTIZACION!D8=\"T\",0,IF(AJ3=\"\",\"\",VLOOKUP(COTIZACION!$D$20,FACTORES!$AC$30:$AD$31,2,0))*AJ3),0)","v":0},{"$f":"IF(AJ3=\"\",\"\",SUM(AJ3:AN3))","v":38859.619994641682},null,null,null,null,null,null,"SI",1.05,null,null,null,null,null,null,"SEMESTRAL"]
[null,1,9815.6049854339035,9779.1276858485235,null,null,15000,0.79800000000000004,0.72099999999999997,null,"15% CON TOPE DE $45,000",0.88800000000000001,null,"BAJA CALIFORNIA NORTE",3,2,null,2,0.71,null,300000,0.71,null,"TRIMESTRAL",7.0000000000000007E-2,{"$f":"+COTIZACION!H38","v":6.9900000000000004E-2},{"$f":"IF(Z4=0,1+Y4,1+Z4)","v":1.0699000000000001},null,"Suma Asegurada",{"$f":"VLOOKUP(COTIZACION!D10,FACTORES!$U$3:$V$24,2,0)","v":1.19},null,"Asistencias",{"$f":"$AD$13","v":78.222375},null,2,{"$f":"(IF(COTIZACION!F29=\"EDAD NO PERMITIDA\",\"EDAD NO PERMITIDA\",IF(IMPRESION!H72=\"\",\"\",IF(IMPRESION!I72=\"HOMBRE\",VLOOKUP(IMPRESION!H72,FACTORES!$B$3:$D$103,2,0)*FACTORES!$AD$9,IF(IMPRESION!I72=\"MUJER\",VLOOKUP(IMPRESION!H72,FACTORES!$B$3:$D$103,3,0)*FACTORES!$AD$9,\"\")))))","v":""},{"$f":"IF(COTIZACION!D29=\"\",\"\",IF(AND(COTIZACION!D29=\"MUJER\",50>COTIZACION!E29,COTIZACION!E29>17,COTIZACION!$D$12>45000),FACTORES!$L$21,IF(AND(COTIZACION!D29=\"mujer\",50>COTIZACION!E29,COTIZACION!E29>17),VLOOKUP(COTIZACION!$D$17,FACTORES!$K$21:$L$23,2,0),0)))","v":""},{"$f":"IF(AND(COTIZACION!E29>17,COTIZACION!E29<60),IF(AJ4=\"\",\"\",$AG$8),IF(AJ4=\"\",\"\",$AG$8-$AG$7))","v":""},{"$f":"IF(AJ4=\"\",\"\",IF(COTIZACION!E29<20,FACTORES!$AG$26,FACTORES!$AG$27))","v":""},{"$f":"IFERROR(IF(COTIZACION!D9=\"T\",0,IF(AJ4=\"\",\"\",VLOOKUP(COTIZACION!$D$20,FACTORES!$AC$30:$AD$31,2,0))*AJ4),0)","v":0},{"$f":"IF(AJ4=\"\",\"\",SUM(AJ4:AN4))","v":""},null,null,null,null,null,null,"NO",1,null,null,null,null,null,null,"TRIMESTRAL"]
[null,2,9815.6049854339035,9779.1276858485235,null,null,20000,0.747,0.67500000000000004,null,"20% CON TOPE DE $60,000",0.85,null,"BAJA CALIFORNIA SUR",5,3,null,3,0.71,null,400000,0.73399999999999999,null,"MENSUAL",0.1,{"$f":"+COTIZACION!H39","v":9.9900000000000003E-2},{"$f":"IF(Z5=0,1+Y5,1+Z5)","v":1.0999000000000001},null,"Deducible",{"$f":"IF(COTIZACION!D11=\"ANUAL\",VLOOKUP(COTIZACION!D12,FACTORES!$G$3:$I$17,3,0),VLOOKUP(COTIZACION!D12,FACTORES!$G$3:$I$17,2,0))","v":0.83099999999999996},null,"Cobertura integral D y V",{"$f":"$AD$17","v":160.56468750000002},null,3,{"$f":"(IF(COTIZACION!F30=\"EDAD NO PERMITIDA\",\"EDAD NO PERMITIDA\",IF(IMPRESION!H73=\"\",\"\",IF(IMPRESION!I73=\"HOMBRE\",VLOOKUP(IMPRESION!H73,FACTORES!$B$3:$D$103,2,0)*FACTORES!$AD$9,IF(IMPRESION!I73=\"MUJER\",VLOOKUP(IMPRESION!H73,FACTORES!$B$3:$D$103,3,0)*FACTORES!$AD$9,\"\")))))","v":""},{"$f":"IF(COTIZACION!D30=\"\",\"\",IF(AND(COTIZACION!D30=\"MUJER\",50>COTIZACION!E30,COTIZACION!E30>17,COTIZACION!$D$12>45000),FACTORES!$L$21,IF(AND(COTIZACION!D30=\"mujer\",50>COTIZACION!E30,COTIZACION!E30>17),VLOOKUP(COTIZACION!$D$17,FACTORES!$K$21:$L$23,2,0),0)))","v":""},{"$f":"IF(AND(COTIZACION!E30>17,COTIZACION!E30<60),IF(AJ5=\"\",\"\",$AG$8),IF(AJ5=\"\",\"\",$AG$8-$AG$7))","v":""},{"$f":"IF(AJ5=\"\",\"\",IF(COTIZACION!E30<20,FACTORES!$AG$26,FACTORES!$AG$27))","v":""},{"$f":"IFERROR(IF(COTIZACION!D10=\"T\",0,IF(AJ5=\"\",\"\",VLOOKUP(COTIZACION!$D$20,FACTORES!$AC$30:$AD$31,2,0))*AJ5),0)","v":0},"",null,null,null,null,null,null,null,null,null,null,null,null,null,null,"MENSUAL"]
[null,3,9815.6049854339035,9779.1276858485235,null,null,25000,0.70399999999999996,0.63600000000000001,null,null,"ok",null,"CAMPECHE",1,1,null,4,0.84,null,500000,0.753,null,null,null,null,null,null,"Coaseguro",{"$f":"VLOOKUP(COTIZACION!D13,FACTORES!$K$3:$L$5,2,0)","v":0.92200000000000004},null,"Visión Incremental",{"$f":"VLOOKUP(COTIZACION!$D$18,FACTORES!$AC$21:$AD$22,2,0)","v":0},null,4,{"$f":"(IF(COTIZACION!F31=\"EDAD NO PERMITIDA\",\"EDAD NO PERMITIDA\",IF(IMPRESION!H74=\"\",\"\",IF(IMPRESION!I74=\"HOMBRE\",VLOOKUP(IMPRESION!H74,FACTORES!$B$3:$D$103,2,0)*FACTORES!$AD$9,IF(IMPRESION!I74=\"MUJER\",VLOOKUP(IMPRESION!H74,FACTORES!$B$3:$D$103,3,0)*FACTORES!$AD$9,\"\")))))","v":""},{"$f":"IF(COTIZACION!D31=\"\",\"\",IF(AND(COTIZACION!D31=\"MUJER\",50>COTIZACION!E31,COTIZACION!E31>17,COTIZACION!$D$12>45000),FACTORES!$L$21,IF(AND(COTIZACION!D31=\"mujer\",50>COTIZACION!E31,COTIZACION!E31>17),VLOOKUP(COTIZACION!$D$17,FACTORES!$K$21:$L$23,2,0),0)))","v":""},{"$f":"IF(AND(COTIZACION!E31>17,COTIZACION!E31<60),IF(AJ6=\"\",\"\",$AG$8),IF(AJ6=\"\",\"\",$AG$8-$AG$7))","v":""},{"$f":"IF(AJ6=\"\",\"\",IF(COTIZACION!E31<20,FACTORES!$AG$26,FACTORES!$AG$27))","v":""},{"$f":"IFERROR(IF(COTIZACION!D11=\"T\",0,IF(AJ6=\"\",\"\",VLOOKUP(COTIZACION!$D$20,FACTORES!$AC$30:$AD$31,2,0))*AJ6),0)","v":0},"",null,null,null,null,null,null,"COBERTURA EN EL EXTRANJERO",null,null,null,5500,541.66999999999996]
[null,4,9815.6049854339035,9779.1276858485235,null,null,30000,0.66400000000000003,0.6,null,null,null,null,"CHIAPAS",3,2,null,5,0.84,null,600000,0.76800000000000002,null,null,null,null,null,null,"Tabulador de Honorarios Médicos",{"$f":"VLOOKUP(COTIZACION!D22,FACTORES!$K$11:$L$16,2,0)","v":1},null,"Enfermedades graves",{"$f":"+IF(OR(COTIZACION!E19=\"COBERTURA NO PERMITIDA POR EDAD\",COTIZACION!D19=\"NO\"),0,VLOOKUP(COTIZACION!D19,FACTORES!X11:AA18,4,FALSE))","v":0},null,5,{"$f":"(IF(COTIZACION!F32=\"EDAD NO PERMITIDA\",\"EDAD NO PERMITIDA\",IF(IMPRESION!H75=\"\",\"\",IF(IMPRESION!I75=\"HOMBRE\",VLOOKUP(IMPRESION!H75,FACTORES!$B$3:$D$103,2,0)*FACTORES!$AD$9,IF(IMPRESION!I75=\"MUJER\",VLOOKUP(IMPRESION!H75,FACTORES!$B$3:$D$103,3,0)*FACTORES!$AD$9,\"\")))))","v":""},{"$f":"IF(COTIZACION!D32=\"\",\"\",IF(AND(COTIZACION!D32=\"MUJER\",50>COTIZACION!E32,COTIZACION!E32>17,COTIZACION!$D$12>45000),FACTORES!$L$21,IF(AND(COTIZACION!D32=\"mujer\",50>COTIZACION!E32,COTIZACION!E32>17),VLOOKUP(COTIZACION!$D$17,FACTORES!$K$21:$L$23,2,0),0)))","v":""},{"$f":"IF(AND(COTIZACION!E32>17,COTIZACION!E32<60),IF(AJ7=\"\",\"\",$AG$8),IF(AJ7=\"\",\"\",$AG$8-$AG$7))","v":""},{"$f":"IF(AJ7=\"\",\"\",IF(COTIZACION!E32<20,FACTORES!$AG$26,FACTORES!$AG$27))","v":""},{"$f":"IFERROR(IF(COTIZACION!D12=\"T\",0,IF(AJ7=\"\",\"\",VLOOKUP(COTIZACION!$D$20,FACTORES!$AC$30:$AD$31,2,0))*AJ7),0)","v":0},"",null,null,null,null,null,null,"ZONA A ",3.3,null,null,6000,574.51]
[null,5,9815.6049854339035,9779.1276858485235,null,null,35000,0.63,0.56999999999999995,null,null,null,null,"CHIHUAHUA",7,4,null,6,1,null,700000,0.78,null,null,null,null,null,null,"Zona",{"$f":"VLOOKUP(COTIZACION!D15,FACTORES!$R$3:$S$12,2,0)","v":1.25},null,null,{"$f":"SUM(AG3:AG7)","v":412.44982732014836},null,6,{"$f":"(IF(COTIZACION!F33=\"EDAD NO PERMITIDA\",\"EDAD NO PERMITIDA\",IF(IMPRESION!H76=\"\",\"\",IF(IMPRESION!I76=\"HOMBRE\",VLOOKUP(IMPRESION!H76,FACTORES!$B$3:$D$103,2,0)*FACTORES!$AD$9,IF(IMPRESION!I76=\"MUJER\",VLOOKUP(IMPRESION!H76,FACTORES!$B$3:$D$103,3,0)*FACTORES!$AD$9,\"\")))))","v":""},{"$f":"IF(COTIZACION!D33=\"\",\"\",IF(AND(COTIZACION!D33=\"MUJER\",50>COTIZACION!E33,COTIZACION!E33>17,COTIZACION!$D$12>45000),FACTORES!$L$21,IF(AND(COTIZACION!D33=\"mujer\",50>COTIZACION!E33,COTIZACION!E33>17),VLOOKUP(COTIZACION!$D$17,FACTORES!$K$21:$L$23,2,0),0)))","v":""},{"$f":"IF(AND(COTIZACION!E33>17,COTIZACION!E33<60),IF(AJ8=\"\",\"\",$AG$8),IF(AJ8=\"\",\"\",$AG$8-$AG$7))","v":""},{"$f":"IF(AJ8=\"\",\"\",IF(COTIZACION!E33<20,FACTORES!$AG$26,FACTORES!$AG$27))","v":""},{"$f":"IFERROR(IF(COTIZACION!D13=\"T\",0,IF(AJ8=\"\",\"\",VLOOKUP(COTIZACION!$D$20,FACTORES!$AC$30:$AD$31,2,0))*AJ8),0)","v":0},"",null,null,null,null,null,null,"ZONA C",1.9,null,null,8000,626.29,null,null,"ZONA","MONTO"]
[null,6,9815.6049854339035,9779.1276858485235,null,null,40000,0.59799999999999998,0.54100000000000004,null,"TABULADOR DE HONORARIOS",null,null,"CIUDAD DE MÉXICO",8,5,null,7,1,null,800000,0.79100000000000004,null,"ENFERMEDADES GRAVES",null,null,null,null,null,{"$f":"AD3*AD4*AD5*AD6*AD7*AD8","v":0.95734440899999995},null,null,null,null,7,{"$f":"(IF(COTIZACION!F34=\"EDAD NO PERMITIDA\",\"EDAD NO PERMITIDA\",IF(IMPRESION!H77=\"\",\"\",IF(IMPRESION!I77=\"HOMBRE\",VLOOKUP(IMPRESION!H77,FACTORES!$B$3:$D$103,2,0)*FACTORES!$AD$9,IF(IMPRESION!I77=\"MUJER\",VLOOKUP(IMPRESION!H77,FACTORES!$B$3:$D$103,3,0)*FACTORES!$AD$9,\"\")))))","v":""},{"$f":"IF(COTIZACION!D34=\"\",\"\",IF(AND(COTIZACION!D34=\"MUJER\",50>COTIZACION!E34,COTIZACION!E34>17,COTIZACION!$D$12>45000),FACTORES!$L$21,IF(AND(COTIZACION!D34=\"mujer\",50>COTIZACION!E34,COTIZACION!E34>17),VLOOKUP(COTIZACION!$D$17,FACTORES!$K$21:$L$23,2,0),0)))","v":""},{"$f":"IF(AND(COTIZACION!E34>17,COTIZACION!E34<60),IF(AJ9=\"\",\"\",$AG$8),IF(AJ9=\"\",\"\",$AG$8-$AG$7))","v":""},{"$f":"IF(AJ9=\"\",\"\",IF(COTIZACION!E34<20,FACTORES!$AG$26,FACTORES!$AG$27))","v":""},{"$f":"IFERROR(IF(COTIZACION!D14=\"T\",0,IF(AJ9=\"\",\"\",VLOOKUP(COTIZACION!$D$20,FACTORES!$AC$30:$AD$31,2,0))*AJ9),0)","v":0},"",null,null,null,null,null,null,null,null,null,null,9000,647.52,null,null,1,0.627,{"$f":"+BE9*$BC$14","v":30973.8}]
[null,7,9815.6049854339035,9779.1276858485235,null,null,45000,0.56999999999999995,0.51500000000000001,null,"Incremento THQ","Factor",null,"COAHUILA",7,4,null,8,1.25,null,1000000,0.81,null,"SUMA ASEGURADA","TARIFA","FACTOR","COSTO",null,null,null,null,null,null,null,8,{"$f":"(IF(COTIZACION!F35=\"EDAD NO PERMITIDA\",\"EDAD NO PERMITIDA\",IF(IMPRESION!H78=\"\",\"\",IF(IMPRESION!I78=\"HOMBRE\",VLOOKUP(IMPRESION!H78,FACTORES!$B$3:$D$103,2,0)*FACTORES!$AD$9,IF(IMPRESION!I78=\"MUJER\",VLOOKUP(IMPRESION!H78,FACTORES!$B$3:$D$103,3,0)*FACTORES!$AD$9,\"\")))))","v":""},{"$f":"IF(COTIZACION!D35=\"\",\"\",IF(AND(COTIZACION!D35=\"MUJER\",50>COTIZACION!E35,COTIZACION!E35>17,COTIZACION!$D$12>45000),FACTORES!$L$21,IF(AND(COTIZACION!D35=\"mujer\",50>COTIZACION!E35,COTIZACION!E35>17),VLOOKUP(COTIZACION!$D$17,FACTORES!$K$21:$L$23,2,0),0)))","v":""},{"$f":"IF(AND(COTIZACION!E35>17,COTIZACION!E35<60),IF(AJ10=\"\",\"\",$AG$8),IF(AJ10=\"\",\"\",$AG$8-$AG$7))","v":""},{"$f":"IF(AJ10=\"\",\"\",IF(COTIZACION!E35<20,FACTORES!$AG$26,FACTORES!$AG$27))","v":""},{"$f":"IFERROR(IF(COTIZACION!D15=\"T\",0,IF(AJ10=\"\",\"\",VLOOKUP(COTIZACION!$D$20,FACTORES!$AC$30:$AD$31,2,0))*AJ10),0)","v":0},"",null,null,null,null,null,null,null,null,null,null,10000,666.48,null,null,2,0.73699999999999999,{"$f":"+BE10*$BC$14","v":36407.800000000003}]
[null,8,9815.6049854339035,9779.1276858485235,null,null,50000,0.54400000000000004,0.49199999999999999,null,0,1,null,"COLIMA",5,3,null,9,1.25,null,2000000,0.86699999999999999,null,"NO",0,0,{"$f":"+Z11*Y11","v":0},null,"ASISTENCIAS",null,null,null,null,null,null,null,null,null,null,null,null,null,null,null,null,null,null,null,null,15000,739.49,{"$f":"AY11/1.8","v":410.82777777777778},null,3,0.82399999999999995,{"$f":"+BC11*$BC$14","v":40705.599999999999}]
[null,9,9815.6049854339035,9779.1276858485235,null,null,75000,0.44400000000000001,0.40100000000000002,null,0.15,1.1000000000000001,null,"DURANGO",5,3,null,10,"-",null,3000000,0.90100000000000002,null,10000,106.63687396464823,1,{"$f":"+Z12*Y12","v":106.63687396464823},null,"RESPUESTA","COSTO",null,null,null,null,null,null,null,null,null,null,null,null,null,null,null,null,null,null,null,20000,791.3,null,null,4,1,{"$f":"+BC12*$BC$14","v":49400}]
[null,10,9815.6049854339035,9779.1276858485235,null,null,100000,0.376,0.34,null,0.25,1.1399999999999999,null,"ESTADO DE MÉXICO",9,5,null,null,null,null,4000000,0.92400000000000004,null,20000,106.63687396464823,2,{"$f":"+Z13*Y13","v":213.27374792929646},null,"SI",78.222375,69.3,72.765000000000001,null,null,null,"Llave","Ramo","Norma","Textos","Llave_2",null,null,null,null,null,null,null,null,null,25000,831.47]
[null,11,9825.420590419335,9681.3364089900369,null,null,null,null,null,null,0.5,1.25,null,"GUANAJUATO",3,2,null,null,null,null,5000000,0.94299999999999995,null,30000,106.63687396464823,3,319.91062189394472,null,null,null,null,null,null,null,{"$f":"+LEFT(AJ14,4)","v":"1T T"},"1T T 16",1200,95000,"1,2,3,5,6,7,8",{"$f":"+VLOOKUP(COTIZACION!D14,FACTORES!N3:O34,2,FALSE)&LEFT(COTIZACION!D8,1)&\" \"&IF(IFERROR(SEARCH(\"TOPE\",COTIZACION!D13,1),\"\")=\"\",\"\",\"T\")","v":"8T T"},null,null,null,null,null,null,null,null,null,30000,1324.73,null,null,"BASE",49400]
[null,12,9835.2460110097527,9584.5230449001374,null,null,null,null,null,null,0.75,1.35,null,"GUERRERO",3,2,null,"NIVEL HOSPITALARIO PREFERENTE",null,null,6000000,0.95799999999999996,null,40000,106.63687396464823,4,426.54749585859292,null,"COBERTURA INTEGRAL DENTAL Y VISIÓN",null,null,null,null,null,{"$f":"+LEFT(AJ15,4)","v":"2T T"},"2T T 16",1200,95001,"1,2,3,5,6,7,8",null,null,null,null,null,null,null,null,null,null,35000,1367.29]
{"$rows_left_out":89}
{"sheet":"TARIFARIO","index":4,"n_rows":102,"n_cols":41,"rows_kept":102,"cut":false,"hidden":true,"merged":[[10,2,11,4],[18,2,19,3],[18,6,19,7],[18,10,19,11],[98,1,99,11],[10,5,11,5]]}
[]
[]
[]
[]
[]
[]
[null,null,null,{"$f":"COTIZACION!D9","v":"FAMILIAR"},null,null,{"$f":"COTIZACION!D8","v":"T+"},null,null,null,"REGION",{"$f":"VLOOKUP(COTIZACION!D14,FACTORES!$N$2:$P$34,3,0)","v":5}]
[]
[null,null,"COBERTURAS OPCIONALES"]
[null,null,"Suma Asegurada para Parto y Cesárea",null,null,{"$f":"IF(COTIZACION!D12>45000,\"$20,000\",IF(COTIZACION!$D$17=\"NO\",\"$20,000\",COTIZACION!$D$17))","v":"$20,000"},null,"Cobertura Total en el Extranjero",null,null,{"$f":"IF(COTIZACION!D20=\"NO\",\"NO INCLUIDO\", \"INCLUIDO\")","v":"NO INCLUIDO"}]
[null,null,"Cobertura de Indemnización por Enfermedad Grave",null,null,{"$f":"IF(OR(COTIZACION!D19=\"NO\",SUM(COTIZACION!A28:A35)<=0),\"Excluido\",COTIZACION!D19)","v":"Excluido"},null,"Tipo de Deducible",null,null,{"$f":"COTIZACION!D11","v":"POR PADECIMIENTO"}]
[null,null,null,null,null,null,null,"Incremento en el Catálogo",null,null,{"$f":"+COTIZACION!$D$22","v":0}]
[]
[]
[null,"SUMA ASEGURADA:",null,{"$f":"COTIZACION!$D$10","v":100000000},null,"SUMA ASEGURADA:",null,{"$f":"COTIZACION!$D$10","v":100000000},null,"SUMA ASEGURADA:",null,{"$f":"COTIZACION!$D$10","v":100000000}]
{"$rows_left_out":88}
{"sheet":"IMPRESION","index":5,"n_rows":218,"n_cols":11,"rows_kept":218,"cut":false,"hidden":true,"merged":[[11,2,11,10],[96,2,96,9],[8,1,9,10],[91,2,91,10],[94,2,95,10],[85,2,85,3],[83,4,83,6],[68,2,69,6],[68,7,69,7],[68,8,69,8],[68,9,69,9],[68,10,69,10],[81,2,81,3],[83,2,83,3],[74,2,74,6],[59,2,59,10],[97,5,98,10],[75,2,75,6],[76,2,76,6],[77,2,77,6],[64,1,64,10],[70,2,70,6],[71,2,71,6],[72,2,72,6],[73,2,73,6],[66,2,66,10]]}
[]
[]
[]
[]
[]
[null,null,null,null,null,null,null,null,null,null,{"$f":"TODAY()","v":"2022-02-03"}]
[null,{"$f":"\"Apreciable  \"&COTIZACION!C28","v":"Apreciable  "}]
[]
[null,{"$f":"+\"Agradecemos de antemano su preferencia y esperamos que la presente propuesta de Gastos Médicos \"&COTIZACION!D9&\" cumpla sus expectativas.\"","v":"Agradecemos de antemano su preferencia y esperamos que la presente propuesta de Gastos Médicos FAMILIAR cumpla sus expectativas."}]
[]
[]
[null,null,"CUADRO DE COBERTURAS"]
[null,null,"-","Suma Asegurada",null,null,null,null,{"$f":"COTIZACION!D10","v":100000000},{"$f":"IF(I13<>\"SIN LÍMITE\",\"M.N.\",\"\")","v":"M.N."}]
[null,null,"-","Tipo de Deducible por Accidente y Enfermedad",null,null,null,null,{"$f":"COTIZACION!D11","v":"POR PADECIMIENTO"}]
[null,null,"-","Deducible por Accidente y Enfermedad",null,null,null,null,{"$f":"COTIZACION!D12","v":12000},"M.N."]
{"$rows_left_out":204}
{"sheet":"IMPRESION_2","index":6,"n_rows":34,"n_cols":11,"rows_kept":34,"cut":false,"hidden":true,"merged":[[24,2,24,10],[8,1,9,10],[11,2,11,10],[12,2,12,10],[23,2,23,10]]}
[]
[]
[]
[]
[]
[null,null,null,null,null,null,null,null,null,null,{"$f":"TODAY()","v":"2022-02-03"}]
[null,{"$f":"\"Apreciable  \"&COTIZACION!C28","v":"Apreciable  "}]
[]
[null,"A continuación le presentamos aplicación de Copago y Coaseguro en caso de siniestro"]
[]
[]
[null,null,"COPAGO EN CASO DE SINIESTRO"]
[null,null,"El copago del asegurado en caso de siniestro es:"]
[]
[null,null,"-","En Red Preferente, nivel hospitalario contratado o menor y misma zona o menor",null,null,null,null,"Sin Copago"]
{"$rows_left_out":20}
{"sheet":"HISTORICO DE TARIFAS","index":7,"n_rows":104,"n_cols":16,"rows_kept":104,"cut":false,"hidden":true,"merged":[]}
[null,null,null,null,null,null,null,null,null,"Nueva",null,null,null,"Renovada"]
[null,"TARIFA 2015-2016",null,null,null,"TARIFA 2017 (01 de enero)",null,null,null,"TARIFA 2017 (01 de agosto)",null,null,null,"TARIFA 2017 (01 de agosto)"]
[null,"EDAD","HOMBRES","MUJERES",null,"EDAD","HOMBRES","MUJERES",null,"EDAD","HOMBRES","MUJERES",null,"EDAD","HOMBRES","MUJERES"]
[null,0,3860.33,3860.33,null,0,{"$f":"+C4*1.12","v":4323.5696000000007},{"$f":"+D4*1.12","v":4323.5696000000007},null,0,{"$f":"+G4*1.4","v":6052.997440000001},{"$f":"+H4*1.4","v":6052.997440000001},null,0,{"$f":"+G4*1.2","v":5188.2835200000009},{"$f":"+H4*1.2","v":5188.2835200000009}]
[null,1,3860.33,3860.33,null,1,{"$f":"+C5*1.12","v":4323.5696000000007},4323.5696000000007,null,1,{"$f":"+G5*1.4","v":6052.997440000001},6052.997440000001,null,1,{"$f":"+G5*1.2","v":5188.2835200000009},5188.2835200000009]
[null,2,3860.33,3860.33,null,2,4323.5696000000007,4323.5696000000007,null,2,6052.997440000001,6052.997440000001,null,2,5188.2835200000009,5188.2835200000009]
[null,3,3860.33,3860.33,null,3,4323.5696000000007,4323.5696000000007,null,3,6052.997440000001,6052.997440000001,null,3,5188.2835200000009,5188.2835200000009]
[null,4,3860.33,3860.33,null,4,4323.5696000000007,4323.5696000000007,null,4,6052.997440000001,6052.997440000001,null,4,5188.2835200000009,5188.2835200000009]
[null,5,3860.33,3860.33,null,5,4323.5696000000007,4323.5696000000007,null,5,6052.997440000001,6052.997440000001,null,5,5188.2835200000009,5188.2835200000009]
[null,6,3860.33,3860.33,null,6,4323.5696000000007,4323.5696000000007,null,6,6052.997440000001,6052.997440000001,null,6,5188.2835200000009,5188.2835200000009]
[null,7,3860.33,3860.33,null,7,4323.5696000000007,4323.5696000000007,null,7,6052.997440000001,6052.997440000001,null,7,5188.2835200000009,5188.2835200000009]
[null,8,3860.33,3860.33,null,8,4323.5696000000007,4323.5696000000007,null,8,6052.997440000001,6052.997440000001,null,8,5188.2835200000009,5188.2835200000009]
[null,9,3860.33,3860.33,null,9,4323.5696000000007,4323.5696000000007,null,9,6052.997440000001,6052.997440000001,null,9,5188.2835200000009,5188.2835200000009]
[null,10,3860.33,3860.33,null,10,4323.5696000000007,4323.5696000000007,null,10,6052.997440000001,6052.997440000001,null,10,5188.2835200000009,5188.2835200000009]
[null,11,3860.33,3860.33,null,11,4323.5696000000007,4323.5696000000007,null,11,6052.997440000001,6052.997440000001,null,11,5188.2835200000009,5188.2835200000009]
{"$rows_left_out":90}
{"sheet":"CAMBIOS","index":8,"n_rows":54,"n_cols":8,"rows_kept":54,"cut":false,"hidden":true,"merged":[]}
["CAMBIOS MEDICO TOTAL"]
[]
["HOJA FACTORES (TABLAS DE CALCULO)"]
["Tabla de Deducible"]
["Tabla de Eliminación de Deducible por Accidente"]
["Nueva Tabla de parto y cesárea"]
["Tabla de Enfermedades Graves"]
["Tabla de Tarifas"]
["Se agrega tabla de Base de honorarios"]
["Se modifica tabla de factores por región a quedar 4"]
[]
["HOJA TITULAR DEL COTIZADOR (CALCULO TARIFA)"]
["Modificación de costos cobertura Adicionales (dental, PAQ_ADIC, ASIST_IKE, CVISION)"]
["Se elimina la cobertura de Educasystem (maestro a domicilio)"]
["Se agrega costo por cobertura de parto y cesárea (amarrado a la tabla que se encuentra en factores)"]
{"$rows_left_out":39}