{"text_format":"1","workbook":"xlsx","n_sheets":12,"sheets":["FACTORES","TITULAR","CONYUGE","DEPENDIENTE","VALORES","CuadroEspecificacionesTARIFARIO","COTIZACION","IMPRESION","TARIFARIO","Instrucciones","Cotizador","CAMBIOS"],"not_rendered":{"charts":0,"images":9,"macros":1,"external_links":1,"defined_names":31,"comments":0,"pivot_tables":0},"unopened":[],"bounds":{"document_bytes":16777216,"sheet_cells":100000,"rows_first":2000,"rows_last":500,"rows_between":2000,"halvings":0,"cell_chars":16384,"cell_head_chars":4096},"cells_cut":0,"cells_raw":0,"read":"whole","date_system":"1900"}

{"sheet":"FACTORES","index":0,"n_rows":445,"n_cols":45,"rows_kept":445,"cut":false,"hidden":true,"merged":[[128,4,128,5],[128,2,128,3],[31,12,31,13],[31,9,31,10],[0,2,0,3],[4,5,4,6],[8,5,8,6],[35,1,35,2],[0,0,0,1],[0,5,0,6],[6,2,6,3],[14,5,14,6],[21,5,21,6],[16,13,16,14]]}
["DEDUCIBLE",null,"COASEGURO",null,"TOPES COA","EMERGENCIA EN EL EXTRANJERO",null,null,null,"DED CERO POR ACC","COSTO",null,null,"RPF","FIJO","CAPTURA","% CALCULO",null,"FACTORES PRIMA DE TARIFA"]
[null,null,0,1.1399999999999999,null,"SI",1.05,null,null,null,null,null,null,"SEMESTRAL",4.7300000000000002E-2,{"$f":"+COTIZACION!H39","v":4.7300000000000002E-2},{"$f":"IF(P2=0,1+O2,1+P2)","v":1.0472999999999999},null,0.26500000000000001,0.26500000000000001,null,null,"ADQUISICIÓN"]
[6000,1,0.05,1.07,"$30,000","NO",1,null,null,null,null,null,null,"TRIMESTRAL",7.0000000000000007E-2,{"$f":"+COTIZACION!H40","v":6.9900000000000004E-2},{"$f":"IF(P3=0,1+O3,1+P3)","v":1.0699000000000001},null,0.15,0.1,null,null,"AMINISTRACIÓN"]
[7000,0.97,0.1,1,"$35,000",null,null,null,null,null,null,null,null,"MENSUAL",0.1,{"$f":"+COTIZACION!H41","v":9.9900000000000003E-2},{"$f":"IF(P4=0,1+O4,1+P4)","v":1.0999000000000001},null,0.15,0.08,null,null,"UTILIDAD"]
[8000,0.94,0.15,0.97,"$40,000","COBERTURA EN EL EXTRANJERO",null,null,null,5500,1132.8788621873468,null,null,null,null,null,null,null,{"$f":"+SUM(S2:S4)","v":0.56500000000000006},{"$f":"+SUM(T2:T4)","v":0.44500000000000001}]
[9000,0.91,0.2,0.93,"$50,000","ZONA A ",3.3,null,null,6000,1201.5513487003436]
[10000,0.88,"Catálogo",null,null,"ZONA B",2.4,null,null,7000,1259.5746934771951,null,null,"BASE DE CATALOGO",null,null,null,null,"DEDUCIBLE CONDICIONADO A POLIZA NUEVA O RENOVADA"]
[15000,0.75900000000000001,0,1,null,"ZONA C",1.9,null,null,8000,1309.8444335458562,null,null,"ZONA","MONTO",null,null,null,{"$f":"+IF(COTIZACION!D$7=COTIZACION!$G$241,\"FAVOR DE SELECCIONAR\",FACTORES!A5)","v":"FAVOR DE SELECCIONAR"},{"$f":"+IF(S8<>8000,\"\",B5)","v":""}]
[20000,0.65400000000000003,0.15,1.0900000000000001,null,"FORMA DE PAGO",null,null,null,9000,1354.2587542913197,null,null,1,0.627,{"$f":"+O9*$O$14","v":38873.997664424998},null,null,{"$f":"+IF(COTIZACION!D$7=COTIZACION!$G$241,\"FAVOR DE SELECCIONAR\",FACTORES!A6)","v":"FAVOR DE SELECCIONAR"},{"$f":"+IF(S9<>9000,\"\",B6)","v":""}]
[25000,0.56699999999999995,0.25,1.1100000000000001,null,"A = ANUAL",0,null,null,10000,1393.9115252574795,null,null,2,0.627,{"$f":"+O10*$O$14","v":38873.997664424998},null,null,10000,0.88]
[30000,0.52,0.5,1.2,null,"S = SEMESTRAL",4.7300000000000002E-2,null,null,15000,1546.6028445316335,null,null,3,0.73699999999999999,{"$f":"+O11*$O$14","v":45693.997254675},null,null,15000,0.76]
[35000,0.48599999999999999,0.75,1.28,null,"T = TRIMESTRAL",7.0000000000000007E-2,null,null,20000,1654.9602746444339,null,null,4,0.82399999999999995,{"$f":"+O12*$O$14","v":51087.996930599998},null,null,20000,0.66]
[40000,0.45700000000000002,1,1.38,null,"M = MENSUAL",0.1,null,null,25000,1738.9791074055913,null,null,5,1,{"$f":"+O13*$O$14","v":61999.996274999998},null,null,25000,0.59]
[45000,0.432,null,null,null,"RENOVADA",null,null,null,30000,2770.5946051986271,null,null,"BASE",61999.996274999998,null,null,null,30000,0.53]
[50000,0.40899999999999997,null,null,"+utilidad","PARTO Y CESAREA",null,null,null,35000,2859.6162824914181,null,null,null,null,null,null,null,35000,0.49]
[60000,0.36899999999999999,null,null,null,20000,3152.1107553658239,null,null,40000,2936.6536537518396,null,null,null,null,null,null,null,40000,0.45]
[70000,0.33500000000000002,null,null,null,30000,3574.0570377184908,null,null,45000,3004.6505149583131,null,null,"Base tabulador",null,null,null,null,45000,0.42]
[75000,0.32,null,null,null,40000,12803.466666666665,null,null,50000,3065.4246199117219,null,null,2019,52400,null,null,null,50000,0.39]
[80000,0.30599999999999999,null,null,null,50000,13364.333333333332,null,null,null,null,null,null,2020,55500,null,null,null,60000,0.34499999999999997]
[90000,0.28100000000000003,null,null,null,null,null,null,null,null,null,null,null,2020,{"$f":"+O19*1.05","v":58275},null,null,null,70000,0.3]
{"$rows_left_out":426}
{"sheet":"TITULAR","index":1,"n_rows":127,"n_cols":19,"rows_kept":127,"cut":false,"hidden":true,"merged":[[25,1,25,2],[1,8,8,9],[14,8,16,9],[24,5,24,6],[24,3,24,4],[23,9,23,10],[23,3,23,4],[23,5,23,6],[228,22,228,23],[228,20,228,21],[151,19,151,26],[213,19,213,22],[156,19,156,26],[212,19,212,26]]}
[null,"GASTOS MÉDICOS MAYORES INDIVIDUAL/FAMILIAR",null,null,null,null,null,null,"REGION COBERTURA BASICA"]
[null,null,null,null,null,null,null,null,{"$f":"IF(ISERROR(VLOOKUP(E3,VALORES!$A$6:$B$11,2,FALSE)),\"REGION NO VALIDA\",VLOOKUP(E3,VALORES!$A$6:$B$11,2,FALSE))","v":"BAJA CALIFORNIA, BAJA CALIFORNIA SUR, MORELOS, QUINTANA ROO, QUERETARO, SAN LUIS POTOSI, SINALOA, SONORA"},null,null,null,"Prima riesgo dental incremental",68.09,null,null,"Prima riesgo visión opcional",119.08]
[null,"REGIÓN:",null,null,{"$f":"+COTIZACION!D14","v":5},{"$f":"IF(E3>7,\"NO PROCEDE\",\" \")","v":" "},"FACTORES",null,null,null,null,null,"Gastos",0.7,null,null,"Gastos",0.7]
[null,null,null,null,null,null,null,null,null,null,null,null,null,{"$f":"ROUND((N2/(1-N3)),2)","v":226.97},null,null,null,{"$f":"ROUND(R2/(1-R3),2)","v":396.93}]
[null,"SUMA ASEGURADA:",null,null,{"$f":"+COTIZACION!D10","v":100000000},null,{"$f":"VLOOKUP(E5,FACTORES!$J$33:$K$124,2)","v":1.53}]
[null,"DEDUCIBLE:",null,null,{"$f":"+COTIZACION!D11","v":10000},null,{"$f":"VLOOKUP(E6,FACTORES!$A$2:$B$29,2,0)","v":0.88},null,null,null,null,null,"Asistencias",48.6]
[null,"ELIMINACION DEDUCIBLE",null,null,{"$f":"+COTIZACION!D15","v":"NO"},null,{"$f":"IF(H7=\"SI\",VLOOKUP(E6,FACTORES!$J$1:$K$21,2,0),0)","v":0},{"$f":"IF(VALUE(COTIZACION!D11)>50000,\"NO\",COTIZACION!D15)","v":"NO"},null,null,null,null,"Gastos",0.7]
[null,"COASEGURO:",null,null,{"$f":"+COTIZACION!D12","v":0.1},null,{"$f":"VLOOKUP(E8,FACTORES!$C$2:$D$6,2)","v":1},null,null,null,null,null,null,{"$f":"ROUND((N6/(1-N7)),2)","v":162}]
[null,"CATALOGO:",null,null,{"$f":"+COTIZACION!D25","v":0},null,{"$f":"VLOOKUP($E$9,FACTORES!$C$8:$D$13,2,FALSE)","v":1}]
[null,"SUMA ASEGURADA PARTO O CESAREA",null,null,{"$f":"+COTIZACION!D17","v":30000},{"$f":"+COTIZACION!D16","v":"NO"},{"$f":"IF(F10=\"NO\",20000,E10)","v":20000}]
[null,"SEGURO DE ENFERMEDADES GRAVES",null,null,{"$f":"+COTIZACION!D19","v":"NO"},null,{"$f":"IF(E11=\"NO\",0,IF(SUM(COTIZACION!A30:A37)>=1,VLOOKUP(E11,FACTORES!$M$33:$N$55,2,0)*(1-DESC),0))","v":0}]
[null,"COBERTURA DE VISION",null,null,{"$f":"+COTIZACION!D18","v":"NO"},null,{"$f":"IF(E12=\"NO\",0,G23)","v":0},null,null,null,null,null,"PaQ Adicional",432.67,0.7]
[null,null,null,null,null,"ZONA",null,null,null,null,null,null,null,20,{"$f":"1-O12","v":0.30000000000000004}]
[null,"EMERGENCIA EXTRANJERO:",null,null,{"$f":"+COTIZACION!D21","v":"NO"},null,{"$f":"IF(E14=\"SI\",FACTORES!$G$2,FACTORES!$G$3)","v":1},null,"ZONA COBERTURAS ADICIONALES",null,null,null,{"$f":"ROUND(N12/O13,2)","v":1442.23},33,null,null,null,null,"S"]
[null,"COBER TOTAL EXTRANJERO:",null,null,{"$f":"+COTIZACION!D20","v":"NO"},{"$f":"+COTIZACION!D22","v":"C"},{"$f":"IF(E15=\"SI\",(IF(F15=\"A\",FACTORES!G6,IF(F15=\"B\",FACTORES!G7,IF(F15=\"C\",FACTORES!G8,\"NO PROCEDE\")))),1)","v":1},null,{"$f":"IF(F14=F15,VLOOKUP(F14,VALORES!$A$31:$B$33,2,FALSE),\"ZONAS DIFERENTES\")","v":"ZONAS DIFERENTES"},null,"A",null,null,98]
[null,null,null,null,null,null,{"$f":"+COTIZACION!D14","v":5},null,null,null,"B",null,null,16]
[null,"FORMA DE PAGO:",null,null,{"$f":"+COTIZACION!#REF!","v":{"$error":"#REF!"}},"Costos",0,null,null,null,"C",null,null,16.3]
[null,"PARTO",null,null,null,null,{"$f":"(IF(COTIZACION!A16=\"NO\",+FACTORES!G16,IF(AND(COTIZACION!A7=1,COTIZACION!A8=1),VLOOKUP(E10,FACTORES!$F$16:$G$19,2,0)*(1-DESC),VLOOKUP(E10,FACTORES!$F$23:$G$26,2,0)*(1-DESC))))","v":3152.1107553658239},"*BUSCARV(G16,FACTORES!$F$30:$G$35,2,0)","=(SI(COTIZACION!A16=\"NO\",+FACTORES!G16,SI(COTIZACION!D7=FACTORES!F14,BUSCARV(G10,FACTORES!$F$16:$G$19,2,0)*(1-DESC),BUSCARV(G10,FACTORES!$F$23:$G$26,2,0)*(1-DESC))))",null,null,null,null,14]
[null,"DENTAL",null,null,null,{"$f":"ROUND(N4,2)","v":226.97},{"$f":"281*0+181.98*0+F19*(1-DESC)","v":226.97},null,null,null,{"$f":"+F19/DENTAL-1","v":0},null,null,3.9]
[null,"PAQ_ADIC",null,null,null,null,{"$f":"611*0+701.81*0+(684*1.135*0)+(M14)*(1-DESC)","v":1442.23},null,null,null,null,null,null,10.39]
{"$rows_left_out":108}
{"sheet":"CONYUGE","index":2,"n_rows":121,"n_cols":15,"rows_kept":121,"cut":false,"hidden":true,"merged":[[17,12,17,13],[19,1,19,2],[1,8,7,9],[11,8,13,9],[18,5,18,6],[18,3,18,4],[17,9,17,10],[17,3,17,4],[17,5,17,6],[149,18,149,19],[149,16,149,17],[71,15,71,22],[134,15,134,18],[76,15,76,22],[133,15,133,22]]}
[null,null,"GASTOS MÉDICOS MAYORES INDIVIDUAL/FAMILIAR",null,null,null,null,null,"REGION COBERTURA BASICA"]
[null,null,null,null,null,null,null,null,{"$f":"IF(ISERROR(VLOOKUP(E3,VALORES!$A$6:$B$11,2,FALSE)),\"REGION NO VALIDA\",VLOOKUP(E3,VALORES!$A$6:$B$11,2,FALSE))","v":"BAJA CALIFORNIA, BAJA CALIFORNIA SUR, MORELOS, QUINTANA ROO, QUERETARO, SAN LUIS POTOSI, SINALOA, SONORA"}]
[null,"REGIÓN:",null,null,{"$f":"+COTIZACION!D14","v":5},{"$f":"IF(E3>7,\"NO PROCEDE\",\" \")","v":" "},"FACTORES"]
[]
[null,"SUMA ASEGURADA:",null,null,{"$f":"+COTIZACION!D10","v":100000000},null,{"$f":"+TITULAR!G5","v":1.53}]
[null,"DEDUCIBLE:",null,null,{"$f":"+COTIZACION!D11","v":10000},null,{"$f":"+TITULAR!G6","v":0.88}]
[null,"COASEGURO:",null,null,{"$f":"+COTIZACION!D12","v":0.1},null,{"$f":"+TITULAR!G8","v":1}]
[null,"CATALOGO:",null,null,{"$f":"+COTIZACION!$D$25","v":0},null,{"$f":"+TITULAR!G9","v":1}]
[null,"SUMA ASEGURADA PARTO O CESAREA",null,null,{"$f":"+COTIZACION!D17","v":30000}]
[null,null,null,null,null,"ZONA",null,null,null,null,null,null,null,null,"A"]
[null,"EMERGENCIA EXTRANJERO:",null,null,{"$f":"+COTIZACION!D21","v":"NO"},null,{"$f":"+TITULAR!G14","v":1},null,"ZONA COBERTURAS ADICIONALES",null,null,null,null,null,"S"]
[null,"COBER TOTAL EXTRANJERO:",null,null,{"$f":"+COTIZACION!D20","v":"NO"},{"$f":"+COTIZACION!D22","v":"C"},{"$f":"+TITULAR!G15","v":1},{"$f":"G12*G11*G8*G7*G6*G5","v":1.3464},{"$f":"IF(F11=F12,VLOOKUP(F11,VALORES!$A$31:$B$33,2,FALSE),\"ZONAS DIFERENTES\")","v":"ZONAS DIFERENTES"},null,"A"]
[null,null,null,null,null,null,null,null,null,null,"B"]
[null,"FORMA DE PAGO:",null,null,{"$f":"+COTIZACION!#REF!","v":{"$error":"#REF!"}},null,{"$f":"+TITULAR!G17","v":0},null,null,null,"C"]
[]
[]
[]
[null,null,null,"PRIMA BASE ",null,"PRIMA TARIFA ",null,"R P FRAC",{"$f":"G14","v":0},"PRIMA TOTAL",null,null,"TARIFA CONYUGUE"]
[null,null,null,"REGIONALIZADA",null,"REGIONALIZADA",null,"DER POLIZA",0,"IVA",{"$f":"+COTIZACION!D26","v":0.16},null,"IVA",{"$f":"+COTIZACION!D26","v":0.16}]
[null,"EDAD",null,"HOMBRE","MUJER","HOMBRE","MUJER","HOMBRE","MUJER","HOMBRE","MUJER",null,"HOMBRE","MUJER"]
{"$rows_left_out":102}
{"sheet":"DEPENDIENTE","index":3,"n_rows":45,"n_cols":19,"rows_kept":45,"cut":false,"hidden":true,"merged":[[19,1,19,2],[18,3,18,4],[17,9,17,10],[17,3,17,4],[17,5,17,6],[1,8,7,9],[10,8,12,9],[18,5,18,6],[145,22,145,23],[145,20,145,21],[68,19,68,26],[130,19,130,22],[73,19,73,26],[129,19,129,26],[28,17,29,18]]}
[null,null,"GASTOS MÉDICOS MAYORES INDIVIDUAL/FAMILIAR",null,null,null,null,null,"REGION COBERTURA BASICA"]
[null,null,null,null,null,null,null,null,{"$f":"IF(ISERROR(VLOOKUP(E3,VALORES!$A$6:$B$11,2,FALSE)),\"REGION NO VALIDA\",VLOOKUP(E3,VALORES!$A$6:$B$11,2,FALSE))","v":"BAJA CALIFORNIA, BAJA CALIFORNIA SUR, MORELOS, QUINTANA ROO, QUERETARO, SAN LUIS POTOSI, SINALOA, SONORA"}]
[null,"REGIÓN:",null,null,{"$f":"+COTIZACION!D14","v":5},{"$f":"IF(E3>7,\"NO PROCEDE\",\" \")","v":" "},"FACTORES"]
[]
[null,"SUMA ASEGURADA:",null,null,{"$f":"+COTIZACION!D10","v":100000000},null,{"$f":"+TITULAR!G5","v":1.53}]
[null,"DEDUCIBLE:",null,null,{"$f":"+COTIZACION!D11","v":10000},null,{"$f":"+TITULAR!G6","v":0.88}]
[null,"COASEGURO:",null,null,{"$f":"+COTIZACION!D12","v":0.1},null,{"$f":"+TITULAR!G8","v":1}]
[null,"CATALOGO:",null,null,{"$f":"COTIZACION!$D$25","v":0},null,{"$f":"+TITULAR!G9","v":1}]
[null,null,null,null,null,"ZONA",null,null,null,null,null,null,null,null,null,null,null,null,"A"]
[null,"EMERGENCIA EXTRANJERO:",null,null,{"$f":"+COTIZACION!D21","v":"NO"},null,{"$f":"+TITULAR!G14","v":1},null,"ZONA COBERTURAS ADICIONALES",null,null,null,null,null,null,null,null,null,"S"]
[null,"COBER TOTAL EXTRANJERO:",null,null,{"$f":"+COTIZACION!D20","v":"NO"},{"$f":"+COTIZACION!D22","v":"C"},{"$f":"+TITULAR!G15","v":1},null,{"$f":"IF(F10=F11,VLOOKUP(F10,VALORES!$A$31:$B$33,2,FALSE),\"ZONAS DIFERENTES\")","v":"ZONAS DIFERENTES"},null,"A"]
[null,null,null,null,null,null,null,null,null,null,"B"]
[null,"FORMA DE PAGO:",null,null,{"$f":"+COTIZACION!#REF!","v":{"$error":"#REF!"}},null,{"$f":"+TITULAR!G17","v":0},null,null,null,"C"]
[]
[]
[]
[]
[null,null,null,"PRIMA BASE ",null,"PRIMA TARIFA ",null,"R P FRAC",{"$f":"G13","v":0},"PRIMA TOTAL"]
[null,null,null,"REGIONALIZADA",null,"REGIONALIZADA",null,"DER POLIZA",0,"IVA",{"$f":"+COTIZACION!D26","v":0.16}]
[null,"EDAD",null,"HOMBRE","MUJER","HOMBRE","MUJER","HOMBRE","MUJER","HOMBRE","MUJER"]
{"$rows_left_out":26}
{"sheet":"VALORES","index":4,"n_rows":38,"n_cols":8,"rows_kept":38,"cut":false,"hidden":true,"merged":[]}
["COTIZACIÓN"]
["R = RENOVACIÓN"]
["N = NUEVA"]
[]
["NO.","REGIÓN"]
[1,"CAMPECHE, CHIAPAS, GUERRERO, OAXACA, TABASCO, TLAXCALA, VERACRUZ, YUCATAN"]
[2,"HIDALGO, NAYARIT, PUEBLA"]
[3,"AGUASCALIENTES, COAHUILA, COLIMA, DURANGO, GUANAJUATO, JALISCO, MICHOACAN, ZACATECAS"]
[4,"CHIHUAHUA, NUEVO LEON, TAMAULIPAS"]
[5,"BAJA CALIFORNIA, BAJA CALIFORNIA SUR, MORELOS, QUINTANA ROO, QUERETARO, SAN LUIS POTOSI, SINALOA, SONORA"]
[6,"DISTRITO FEDERAL, EDO. DE MEXICO"]
[]
["SUMA ASEGURADA",null,"DEDUCIBLE",null,"COASEGURO",null,"FORMA DE PAGO","FORMA DE PAGO"]
[500000,null,4000,null,0,null,"A","ANUAL"]
[750000,null,4500,null,0.05,null,"S","SEMESTRAL"]
[1000000,null,5000,null,0.1]
[{"$f":"+A16+1000000","v":2000000},null,6000,null,0.15]
[{"$f":"+A17+1000000","v":3000000},null,7000,null,0.2]
[4000000,null,8000,null,0.25]
[5000000,null,9000,null,0.3]
{"$rows_left_out":19}
{"sheet":"CuadroEspecificacionesTARIFARIO","index":5,"n_rows":71,"n_cols":10,"rows_kept":71,"cut":false,"hidden":true,"merged":[[8,2,8,9],[13,1,13,9]]}
[]
[]
[]
[]
[]
[]
[]
[]
[]
[null,null,null,null,null,null,null,null,null,{"$f":"TODAY()","v":"2022-02-03"}]
[]
[null,null,null,null,null,null,null,null,"REGIÓN",{"$f":"TITULAR!E3","v":5}]
[]
[null,"CUADRO DE COBERTURAS"]
[null,"-","Tipo de Hospital",null,null,null,null,"Todos los hospitales"]
[]
[null,"-","Suma Asegurada",null,null,null,null,{"$f":"+TITULAR!E5","v":100000000},{"$f":"IF(H17<>\"SIN LÍMITE\",\"M.N.\",\"\")","v":"M.N."}]
[]
[null,"-","Deducible",null,null,"Enfermedad",null,{"$f":"+TITULAR!E6","v":10000},"M.N."]
[null,null,null,null,null,"Accidente",null,0,"M.N."]
{"$rows_left_out":52}
{"sheet":"COTIZACION","index":6,"n_rows":366,"n_cols":11,"rows_kept":366,"cut":false,"hidden":true,"merged":[[5,1,5,2],[22,5,23,7],[10,12,10,19],[79,12,79,15],[17,11,18,19],[41,2,41,4],[38,8,40,9],[14,1,14,2],[21,5,21,7],[43,1,43,5],[44,1,45,4],[92,14,92,15],[90,14,90,15],[104,12,104,19],[105,12,106,19],[96,13,96,15],[94,12,94,13],[91,14,91,15]]}
[]
[]
[]
[]
[]
[null,"DATOS DE LA PÓLIZA"]
[{"$f":"+VLOOKUP(D7,G241:H242,2,FALSE)","v":0},"Tipo de Póliza",null,"NUEVA",{"$f":"+IF(AND(D7=\"NUEVA\",D8=\"ANTES DEL 01/10/2016\"),\"NO ES VÁLIDA, RECONSIDERAR SU PRIMERA EMISIÓN\",CONCATENATE(\"APLICA PARA AQUELLA PÓLIZA \",D7,\" CON PRIMER VIGENCIA EMITIDA \",D8))","v":"APLICA PARA AQUELLA PÓLIZA NUEVA CON PRIMER VIGENCIA EMITIDA A PARTIR DEL 01/10/2016"}]
[{"$f":"+VLOOKUP(D8,G243:H244,2,FALSE)","v":0},"Primera vigencia emitida en Seguros Banorte",null,"A PARTIR DEL 01/10/2016"]
[null,"TIPO DE COTIZACIÓN",null,"INDIVIDUAL"]
[null,"Suma Asegurada",null,100000000]
[null,"Deducible",null,10000,{"$f":"+IF(D7=\"NUEVA\",IF(D11<10000,\"Deducible no permitido para pólizas nuevas\",\"\"),\"\")","v":""}]
[null,{"$f":"+\"Coaseguro \"&CONCATENATE(\"con tope de \",VLOOKUP(IMPRESION!I19,FACTORES!C3:E6,3,FALSE))","v":"Coaseguro con tope de $35,000"},null,0.1]
[null,"Estado",null,"CIUDAD DE MÉXICO"]
[null,"Región",null,{"$f":"+VLOOKUP(D13,$C$316:$D$347,2,0)","v":5}]
[{"$f":"IF(AND(D15=\"SI\",D11>50000),\"EL LIMITE ES $50,000\",\" \")","v":" "},"Eliminación de Deducible por Accidente",null,"NO",{"$f":"+IF(AND(D15=\"si\",D11>50000),\"El deducible límite es $50,000\",\"\")","v":""}]
[{"$f":"IF(D11>50000,\"NO\",D16)","v":"NO"},"Incremento en Parto o Cesárea",null,"NO"]
[null,"Suma Asegurada Parto o Cesárea",null,30000,{"$f":"IF(D7=\"NUEVA\",IF(D17=50000,\"SUMA ASEGURADA NO PERMITIDA PARA PÓLIZAS NUEVAS\",IF(D16=\"SI\",IF(D11<60000,\"DEFINA LA SUMA ASEGURADA\",\"ESTA COBERTURA NO APLICA CON DEDUCIBLE MAYOR A $50,000\"),\"\")),IF(D16=\"SI\",IF(D11<60000,\"DEFINA LA SUMA ASEGURADA\",\"ESTA COBERTURA NO APLICA CON DEDUCIBLE MAYOR A $50,000\"),\"\"))","v":""}]
[null,"Cobertura de Visión Incremental",null,"NO"]
[null,"Cobertura de Indemnización por Enfermedad Grave",null,"NO",{"$f":"IF(AND(D19<>\"NO\",SUM(A30:A37)<1),\"NO CUMPLE CON LOS LIMITES DE EDAD\",\"\")","v":""}]
[null,"Cobertura Total en el Extranjero",null,"NO",{"$f":"IF(D20=\"SI\",\"DEFINA LA ZONA COBERTURA TOTAL EN EL EXTRANJERO\",\"\")","v":""}]
{"$rows_left_out":347}
{"sheet":"IMPRESION","index":7,"n_rows":230,"n_cols":11,"rows_kept":230,"cut":false,"hidden":true,"merged":[[104,2,105,11],[8,1,9,10],[74,2,74,10],[99,2,99,10],[102,2,103,10],[93,2,93,3],[11,1,11,10],[91,4,91,6],[75,2,76,6],[75,7,76,7],[75,8,76,8],[75,9,76,9],[94,2,94,3],[85,2,88,7]]}
[]
[]
[]
[]
[]
[null,null,null,null,null,null,null,null,null,null,{"$f":"TODAY()","v":"2022-02-03"}]
[null,{"$f":"\"Apreciable  \"&COTIZACION!C30","v":"Apreciable  "}]
[]
[null,{"$f":"+\"Agradecemos de antemano su preferencia y esperamos que la presente propuesta de Gastos Médicos \"&COTIZACION!D9&\" cumpla sus expectativas.\"","v":"Agradecemos de antemano su preferencia y esperamos que la presente propuesta de Gastos Médicos INDIVIDUAL cumpla sus expectativas."}]
[]
[]
[null,"CUADRO DE COBERTURAS"]
[null,"-","Tipo de Hospital",null,null,null,null,null,"Todos los hospitales"]
[]
[null,"-","Suma Asegurada",null,null,null,null,null,{"$f":"+CuadroEspecificacionesTARIFARIO!H17","v":100000000},{"$f":"IF(I15<>\"SIN LÍMITE\",\"M.N.\",\"\")","v":"M.N."}]
[]
[null,"-","Deducible por Accidente y Enfermedad",null,null,null,null,null,{"$f":"+CuadroEspecificacionesTARIFARIO!H19","v":10000},"M.N."]
[]
[null,"-","Coaseguro",null,null,null,"Enfermedad",null,{"$f":"+CuadroEspecificacionesTARIFARIO!H22","v":0.1},{"$f":"+CONCATENATE(\"Con tope de \",VLOOKUP(I19,FACTORES!C3:E6,3,FALSE)&\" M.N.\")","v":"Con tope de $35,000 M.N."}]
[null,null,null,null,null,null,"Accidente",null,0]
{"$rows_left_out":211}
{"sheet":"TARIFARIO","index":8,"n_rows":95,"n_cols":12,"rows_kept":95,"cut":false,"hidden":true,"merged":[[10,7,11,9],[92,1,92,11],[18,10,19,11],[18,6,19,7],[18,2,19,3],[74,2,75,3]]}
[]
[]
[]
[]
[]
[]
[null,null,null,{"$f":"+COTIZACION!D7","v":"NUEVA"},null,null,null,null,null,null,"REGION",{"$f":"+COTIZACION!D14","v":5}]
[]
[null,null,"COBERTURAS OPCIONALES"]
[null,null,"Suma Asegurada para Parto y Cesárea",null,null,{"$f":"IF(COTIZACION!D11>50000,\"No incluido\",IF(COTIZACION!D16=\"si\",COTIZACION!D17,\"$20,000 Cobertura Básica\"))","v":"$20,000 Cobertura Básica"},null,"Cobertura Total en el Extranjero",null,null,{"$f":"IF(COTIZACION!D20=\"SI\",\"Incluido\"&\" con Zona \"&COTIZACION!D22,\"No Incluido\")","v":"No Incluido"}]
[null,null,"Eliminación de Deducible por Accidente",null,null,{"$f":"IF(COTIZACION!D11>50000,\"No incluido\",IF(COTIZACION!D15=\"SI\",\"Incluido\",\"No Incluido\"))","v":"No Incluido"},null,"Cobertura de Indemnización por Enfermedad Grave",null,null,{"$f":"IF(AND(COTIZACION!D19<>\"NO\",COTIZACION!E19=\"\"),COTIZACION!D19,\"No Incluido\")","v":"No Incluido"}]
[null,null,"Emergencia en el Extranjero",null,null,{"$f":"IF(COTIZACION!D21=\"SI\",\"Incluido\",\"No Incluido\")","v":"No Incluido"}]
[]
[]
[null,"SUMA ASEGURADA:",null,{"$f":"TITULAR!E5","v":100000000},null,"SUMA ASEGURADA:",null,{"$f":"CONYUGE!E5","v":100000000},null,"SUMA ASEGURADA:",null,{"$f":"DEPENDIENTE!E5","v":100000000}]
[null,"DEDUCIBLE:",null,{"$f":"TITULAR!E6","v":10000},null,"DEDUCIBLE:",null,{"$f":"CONYUGE!E6","v":10000},null,"DEDUCIBLE:",null,{"$f":"DEPENDIENTE!E6","v":10000}]
[null,"COASEGURO:",null,{"$f":"TITULAR!E8","v":0.1},null,"COASEGURO:",null,{"$f":"CONYUGE!E7","v":0.1},null,"COASEGURO:",null,{"$f":"DEPENDIENTE!E7","v":0.1}]
[]
[null,null,null,null,null,null,"PRIMA TOTAL CONYUGE"]
[]
{"$rows_left_out":76}
{"sheet":"Instrucciones","index":9,"n_rows":45,"n_cols":9,"rows_kept":45,"cut":false,"hidden":true,"merged":[[9,1,9,8],[16,1,16,8],[18,1,18,8],[19,1,19,8],[21,1,21,8],[11,1,11,8],[13,1,13,8],[20,1,20,8],[12,1,12,8],[17,1,17,8],[36,1,36,8],[32,1,32,8],[37,1,37,8],[43,1,43,8],[51,1,51,8],[35,1,35,8],[38,1,38,8],[40,1,40,8],[41,1,41,8],[42,1,42,8],[44,1,44,8],[29,1,29,8],[30,1,30,8],[33,1,33,8],[34,1,34,8],[28,1,28,8],[22,1,22,8],[23,1,23,8],[24,1,24,8],[25,1,25,8],[27,1,27,8],[26,1,26,8]]}
[]
[]
[]
[]
[]
[]
[null,null,null,null,null,null,null,null,{"$f":"TODAY()","v":"2022-02-03"}]
[]
[]
[null,"INSTRUCCIONES"]
[]
[null,"Seguros Banorte elaboró para ti esta herramienta de sencilla utilización de la que . . . "]
[null," ¡Estamos seguros, te será de gran utilidad!"]
[]
[]
[]
[null,"1. Seleccione el TIPO DE COTIZACIÓN (Individual o Familiar)"]
[null,"2. Seleccione la fecha de PRIMER VIGENCIA en Seguros Banorte de la póliza a cotizar"]
[null,"3. Seleccione la SUMA ASEGURADA deseada"]
[null,"4. Seleccione el DEDUCIBLE deseado"]
{"$rows_left_out":26}
{"sheet":"Cotizador","index":10,"n_rows":0,"n_cols":0,"rows_kept":0,"cut":false,"hidden":false,"merged":[]}

{"sheet":"CAMBIOS","index":11,"n_rows":54,"n_cols":8,"rows_kept":54,"cut":false,"hidden":true,"merged":[]}
["CAMBIOS MEDICO TOTAL"]
[]
["HOJA FACTORES (TABLAS DE CALCULO)"]
["Tabla de Deducible"]
["Tabla de Eliminación de Deducible por Accidente"]
["Nueva Tabla de parto y cesárea"]
["Tabla de Enfermedades Graves"]
["Tabla de Tarifas"]
["Se agrega tabla de Base de honorarios"]
["Se modifica tabla de factores por región a quedar 4"]
[]
["HOJA TITULAR DEL COTIZADOR (CALCULO TARIFA)"]
["Modificación de costos cobertura Adicionales (dental, PAQ_ADIC, ASIST_IKE, CVISION)"]
["Se elimina la cobertura de Educasystem (maestro a domicilio)"]
["Se agrega costo por cobertura de parto y cesárea (amarrado a la tabla que se encuentra en factores)"]
["Modificación de costo de Derecho de Póliza a 700 pesos"]
[]
["HOJA COTIZACION (COTIZADOR)"]
["Se deja deducible mínimo en 6,000"]
["se modifica Querétaro a zona 4"]
{"$rows_left_out":34}